Reaction Details
TargetCalpain-1 catalytic subunit
LigandBDBM50039998
Substrate/Competitorn/a
Meas. Tech.ChEMBL_43688 (CHEMBL653666)
Ki 32±n/a nM
Citation Harbeson, SLAbelleira, SMAkiyama, ABarrett, RCarroll, RMStraub, JATkacz, JNWu, CMusso, GF Stereospecific synthesis of peptidyl alpha-keto amides as inhibitors of calpain. J Med Chem37:2918-29 (1994) Calpain-1 catalytic subunit
Name:Calpain-1 catalytic subunit
Type:Protein
Mol. Mass.:81880.51
Organism:Homo sapiens (Human)
Description:n/a
Residue:714
BDBM50039998
NameBDBM50039998
Synonyms:CHEMBL99129 | [(S)-1-((S)-1-Ethylcarbamoyl-butylcarbamoyl)-3-methyl-butyl]-carbamic acid benzyl ester
TypeSmall organic molecule
Emp. Form.C21H33N3O4
Mol. Mass.391.5044
SMILESCCC[C@H](NC(=O)[C@H](CC(C)C)NC(=O)OCc1ccccc1)C(=O)NCC