Reaction Details
TargetD(1A) dopamine receptor
LigandBDBM50040241
Substrate/Competitorn/a
Meas. Tech.ChEBML_58668
Ki 141±n/a nM
Citation Liégeois, JFBruhwyler, JDamas, JNguyen, TPChleide, EMMercier, MGRogister, FADelarge, JE New pyridobenzodiazepine derivatives as potential antipsychotics: synthesis and neurochemical study. J Med Chem36:2107-14 (1993) D(1A) dopamine receptor
Name:D(1A) dopamine receptor
Type:Enzyme Catalytic Domain
Mol. Mass.:49429.75
Organism:RAT
Description:P18901
Residue:446
BDBM50040241
NameBDBM50040241
Synonyms:3-Fluoro-6-(4-methyl-piperazin-1-yl)-11H-dibenzo[b,e]azepine CHEMBL63756 | Fluperlapine
TypeSmall organic molecule
Emp. Form.C19H20FN3
Mol. Mass.309.3806
SMILESCN1CCN(CC1)C1=Nc2cc(F)ccc2Cc2ccccc12