Reaction Details
TargetGastrin-releasing peptide receptor
LigandBDBM50407277
Substrate/Competitorn/a
Meas. Tech.ChEMBL_461 (CHEMBL615691)
IC50 3±n/a nM
Citation Leban, JJLandavazo, AMcDermed, JDDiliberto, EJJansen, MStockstill, BKull, FC Potent gastrin-releasing peptide (GRP) antagonists derived from GRP (19-27) with a C-terminal DPro psi [CH2NH]Phe-NH2 and N-terminal aromatic residues. J Med Chem37:439-45 (1994) Gastrin-releasing peptide receptor
Name:Gastrin-releasing peptide receptor
Type:Enzyme Catalytic Domain
Mol. Mass.:43234.59
Organism:MOUSE
Description:Gastrin-Releasing peptide 0 MOUSE::P21729
Residue:384
BDBM50407277
NameBDBM50407277
Synonyms:CHEMBL2112785
TypeSmall organic molecule
Emp. Form.C57H72N14O8
Mol. Mass.1081.2706
SMILESCC(C)[C@H](NC(=O)[C@H](C)NC(=O)[C@H](Cc1c[nH]c2ccccc12)NC(=O)[C@H](Cc1cnc[nH]1)NC(=O)[C@H](C)c1ccccc1)C(=O)N[C@H](C)C(=O)N[C@@H](Cc1cnc[nH]1)C(=O)N1CCC[C@@H]1CN[C@@H](Cc1ccccc1)C(N)=O