Reaction Details
TargetcGMP-specific 3',5'-cyclic phosphodiesterase
LigandBDBM50040345
Substrate/Competitorn/a
Meas. Tech.ChEMBL_155377 (CHEMBL760830)
IC50 68000±n/a nM
Citation Buckle, DRArch, JRConnolly, BJFenwick, AEFoster, KAMurray, KJReadshaw, SASmallridge, MSmith, DG Inhibition of cyclic nucleotide phosphodiesterase by derivatives of 1,3-bis(cyclopropylmethyl)xanthine. J Med Chem37:476-85 (1994) cGMP-specific 3',5'-cyclic phosphodiesterase
Name:cGMP-specific 3',5'-cyclic phosphodiesterase
Type:Protein
Mol. Mass.:99975.83
Organism:Homo sapiens (Human)
Description:O76074
Residue:875
BDBM50040345
NameBDBM50040345
Synonyms:CHEMBL146165 | N-(1,3-Bis-cyclopropylmethyl-2,6-dioxo-2,3,6,7-tetrahydro-1H-purin-8-yl)-4-methoxy-benzenesulfonamide
TypeSmall organic molecule
Emp. Form.C20H23N5O5S
Mol. Mass.445.492
SMILESCOc1ccc(cc1)S(=O)(=O)Nc1nc2n(CC3CC3)c(=O)n(CC3CC3)c(=O)c2[nH]1