Reaction Details
TargetcGMP-specific 3',5'-cyclic phosphodiesterase
LigandBDBM50040363
Substrate/Competitorn/a
Meas. Tech.ChEMBL_155377 (CHEMBL760830)
IC50 20000±n/a nM
Citation Buckle, DRArch, JRConnolly, BJFenwick, AEFoster, KAMurray, KJReadshaw, SASmallridge, MSmith, DG Inhibition of cyclic nucleotide phosphodiesterase by derivatives of 1,3-bis(cyclopropylmethyl)xanthine. J Med Chem37:476-85 (1994) cGMP-specific 3',5'-cyclic phosphodiesterase
Name:cGMP-specific 3',5'-cyclic phosphodiesterase
Type:Protein
Mol. Mass.:99975.83
Organism:Homo sapiens (Human)
Description:O76074
Residue:875
BDBM50040363
NameBDBM50040363
Synonyms:1,3-Bis(cyclopropylmethyl)-8-bis[(phenylsulfonyl)amino]xanthine | CHEMBL358296
TypeSmall organic molecule
Emp. Form.C25H25N5O6S2
Mol. Mass.555.626
SMILESO=c1n(CC2CC2)c2nc([nH]c2c(=O)n1CC1CC1)N(S(=O)(=O)c1ccccc1)S(=O)(=O)c1ccccc1