Reaction Details
TargetcGMP-specific 3',5'-cyclic phosphodiesterase
LigandBDBM50040348
Substrate/Competitorn/a
Meas. Tech.ChEMBL_155380 (CHEMBL760833)
Ki 7500±n/a nM
Citation Buckle, DRArch, JRConnolly, BJFenwick, AEFoster, KAMurray, KJReadshaw, SASmallridge, MSmith, DG Inhibition of cyclic nucleotide phosphodiesterase by derivatives of 1,3-bis(cyclopropylmethyl)xanthine. J Med Chem37:476-85 (1994) cGMP-specific 3',5'-cyclic phosphodiesterase
Name:cGMP-specific 3',5'-cyclic phosphodiesterase
Type:Protein
Mol. Mass.:99975.83
Organism:Homo sapiens (Human)
Description:O76074
Residue:875
BDBM50040348
NameBDBM50040348
Synonyms:8-Amino-1,3-bis-cyclopropylmethyl-3,7-dihydro-purine-2,6-dione CHEMBL356323
TypeSmall organic molecule
Emp. Form.C13H17N5O2
Mol. Mass.275.3064
SMILESNc1nc2n(CC3CC3)c(=O)n(CC3CC3)c(=O)c2[nH]1