Reaction Details
TargetcGMP-specific 3',5'-cyclic phosphodiesterase
LigandBDBM50040373
Substrate/Competitorn/a
Meas. Tech.ChEMBL_155377 (CHEMBL760830)
IC50 53000±n/a nM
Citation Buckle, DRArch, JRConnolly, BJFenwick, AEFoster, KAMurray, KJReadshaw, SASmallridge, MSmith, DG Inhibition of cyclic nucleotide phosphodiesterase by derivatives of 1,3-bis(cyclopropylmethyl)xanthine. J Med Chem37:476-85 (1994) cGMP-specific 3',5'-cyclic phosphodiesterase
Name:cGMP-specific 3',5'-cyclic phosphodiesterase
Type:Protein
Mol. Mass.:99975.83
Organism:Homo sapiens (Human)
Description:O76074
Residue:875
BDBM50040373
NameBDBM50040373
Synonyms:CHEMBL344720 | N-(1,3-Bis-cyclopropylmethyl-7-methyl-2,6-dioxo-2,3,6,7-tetrahydro-1H-purin-8-yl)-benzenesulfonamide
TypeSmall organic molecule
Emp. Form.C20H23N5O4S
Mol. Mass.429.493
SMILESCn1c(NS(=O)(=O)c2ccccc2)nc2n(CC3CC3)c(=O)n(CC3CC3)c(=O)c12