Reaction Details
TargetcGMP-specific 3',5'-cyclic phosphodiesterase
LigandBDBM50040350
Substrate/Competitorn/a
Meas. Tech.ChEMBL_155377 (CHEMBL760830)
IC50 32000±n/a nM
Citation Buckle, DRArch, JRConnolly, BJFenwick, AEFoster, KAMurray, KJReadshaw, SASmallridge, MSmith, DG Inhibition of cyclic nucleotide phosphodiesterase by derivatives of 1,3-bis(cyclopropylmethyl)xanthine. J Med Chem37:476-85 (1994) cGMP-specific 3',5'-cyclic phosphodiesterase
Name:cGMP-specific 3',5'-cyclic phosphodiesterase
Type:Protein
Mol. Mass.:99975.83
Organism:Homo sapiens (Human)
Description:O76074
Residue:875
BDBM50040350
NameBDBM50040350
Synonyms:8-Amino-1,3-bis-cyclopropylmethyl-7-methanesulfonyl-3,7-dihydro-purine-2,6-dione | CHEMBL341866
TypeSmall organic molecule
Emp. Form.C14H19N5O4S
Mol. Mass.353.397
SMILESCS(=O)(=O)n1c(N)nc2n(CC3CC3)c(=O)n(CC3CC3)c(=O)c12