Reaction Details
TargetcGMP-specific 3',5'-cyclic phosphodiesterase
LigandBDBM50040371
Substrate/Competitorn/a
Meas. Tech.ChEMBL_155377 (CHEMBL760830)
IC50 50±n/a nM
Citation Buckle, DRArch, JRConnolly, BJFenwick, AEFoster, KAMurray, KJReadshaw, SASmallridge, MSmith, DG Inhibition of cyclic nucleotide phosphodiesterase by derivatives of 1,3-bis(cyclopropylmethyl)xanthine. J Med Chem37:476-85 (1994) cGMP-specific 3',5'-cyclic phosphodiesterase
Name:cGMP-specific 3',5'-cyclic phosphodiesterase
Type:Protein
Mol. Mass.:99975.83
Organism:Homo sapiens (Human)
Description:O76074
Residue:875
BDBM50040371
NameBDBM50040371
Synonyms:1,3-Bis-cyclopropylmethyl-7-(4-methoxy-benzyl)-8-[1-methyl-pyrrolidin-(2Z)-ylideneamino]-3,7-dihydro-purine-2,6-dione | CHEMBL144196
TypeSmall organic molecule
Emp. Form.C26H32N6O3
Mol. Mass.476.5707
SMILESCOc1ccc(Cn2c(N=C3CCCN3C)nc3n(CC4CC4)c(=O)n(CC4CC4)c(=O)c23)cc1