Reaction Details
TargetcGMP-specific 3',5'-cyclic phosphodiesterase
LigandBDBM50040351
Substrate/Competitorn/a
Meas. Tech.ChEMBL_155377 (CHEMBL760830)
IC50 14000±n/a nM
Citation Buckle, DRArch, JRConnolly, BJFenwick, AEFoster, KAMurray, KJReadshaw, SASmallridge, MSmith, DG Inhibition of cyclic nucleotide phosphodiesterase by derivatives of 1,3-bis(cyclopropylmethyl)xanthine. J Med Chem37:476-85 (1994) cGMP-specific 3',5'-cyclic phosphodiesterase
Name:cGMP-specific 3',5'-cyclic phosphodiesterase
Type:Protein
Mol. Mass.:99975.83
Organism:Homo sapiens (Human)
Description:O76074
Residue:875
BDBM50040351
NameBDBM50040351
Synonyms:8-Amino-1,3-bis-cyclopropylmethyl-7-propyl-3,7-dihydro-purine-2,6-dione | CHEMBL144374
TypeSmall organic molecule
Emp. Form.C16H23N5O2
Mol. Mass.317.3861
SMILESCCCn1c(N)nc2n(CC3CC3)c(=O)n(CC3CC3)c(=O)c12