Reaction Details
TargetcGMP-specific 3',5'-cyclic phosphodiesterase
LigandBDBM50040379
Substrate/Competitorn/a
Meas. Tech.ChEMBL_155377 (CHEMBL760830)
IC50 240±n/a nM
Citation Buckle, DRArch, JRConnolly, BJFenwick, AEFoster, KAMurray, KJReadshaw, SASmallridge, MSmith, DG Inhibition of cyclic nucleotide phosphodiesterase by derivatives of 1,3-bis(cyclopropylmethyl)xanthine. J Med Chem37:476-85 (1994) cGMP-specific 3',5'-cyclic phosphodiesterase
Name:cGMP-specific 3',5'-cyclic phosphodiesterase
Type:Protein
Mol. Mass.:99975.83
Organism:Homo sapiens (Human)
Description:O76074
Residue:875
BDBM50040379
NameBDBM50040379
Synonyms:CHEMBL423559 | N'-[1,3-Bis-cyclopropylmethyl-7-(4-methoxy-benzyl)-2,6-dioxo-2,3,6,7-tetrahydro-1H-purin-8-yl]-N,N-dimethyl-formamidine
TypeSmall organic molecule
Emp. Form.C24H30N6O3
Mol. Mass.450.5334
SMILESCOc1ccc(Cn2c(\N=C\N(C)C)nc3n(CC4CC4)c(=O)n(CC4CC4)c(=O)c23)cc1