Reaction Details
TargetcGMP-specific 3',5'-cyclic phosphodiesterase
LigandBDBM50040366
Substrate/Competitorn/a
Meas. Tech.ChEMBL_155377 (CHEMBL760830)
IC50 8300±n/a nM
Citation Buckle, DRArch, JRConnolly, BJFenwick, AEFoster, KAMurray, KJReadshaw, SASmallridge, MSmith, DG Inhibition of cyclic nucleotide phosphodiesterase by derivatives of 1,3-bis(cyclopropylmethyl)xanthine. J Med Chem37:476-85 (1994) cGMP-specific 3',5'-cyclic phosphodiesterase
Name:cGMP-specific 3',5'-cyclic phosphodiesterase
Type:Protein
Mol. Mass.:99975.83
Organism:Homo sapiens (Human)
Description:O76074
Residue:875
BDBM50040366
NameBDBM50040366
Synonyms:8-Amino-1,3-bis-cyclopropylmethyl-7-(4-nitro-benzyl)-3,7-dihydro-purine-2,6-dione | CHEMBL423933
TypeSmall organic molecule
Emp. Form.C20H22N6O4
Mol. Mass.410.4265
SMILESNc1nc2n(CC3CC3)c(=O)n(CC3CC3)c(=O)c2n1Cc1ccc(cc1)[N+]([O-])=O