Reaction Details
TargetcGMP-specific 3',5'-cyclic phosphodiesterase
LigandBDBM50020874
Substrate/Competitorn/a
Meas. Tech.ChEMBL_155378 (CHEMBL760831)
IC50 500±n/a nM
Citation Buckle, DRArch, JRConnolly, BJFenwick, AEFoster, KAMurray, KJReadshaw, SASmallridge, MSmith, DG Inhibition of cyclic nucleotide phosphodiesterase by derivatives of 1,3-bis(cyclopropylmethyl)xanthine. J Med Chem37:476-85 (1994) cGMP-specific 3',5'-cyclic phosphodiesterase
Name:cGMP-specific 3',5'-cyclic phosphodiesterase
Type:Protein
Mol. Mass.:99975.83
Organism:Homo sapiens (Human)
Description:O76074
Residue:875
BDBM50020874
NameBDBM50020874
Synonyms:(3-Chloro-phenyl)-(4-phenyl-phthalazin-1-yl)-amine | CHEMBL332898
TypeSmall organic molecule
Emp. Form.C20H14ClN3
Mol. Mass.331.798
SMILESClc1cccc(Nc2nnc(-c3ccccc3)c3ccccc23)c1