Reaction Details
TargetcGMP-specific 3',5'-cyclic phosphodiesterase
LigandBDBM50040352
Substrate/Competitorn/a
Meas. Tech.ChEMBL_155377 (CHEMBL760830)
IC50 3000±n/a nM
Citation Buckle, DRArch, JRConnolly, BJFenwick, AEFoster, KAMurray, KJReadshaw, SASmallridge, MSmith, DG Inhibition of cyclic nucleotide phosphodiesterase by derivatives of 1,3-bis(cyclopropylmethyl)xanthine. J Med Chem37:476-85 (1994) cGMP-specific 3',5'-cyclic phosphodiesterase
Name:cGMP-specific 3',5'-cyclic phosphodiesterase
Type:Protein
Mol. Mass.:99975.83
Organism:Homo sapiens (Human)
Description:O76074
Residue:875
BDBM50040352
NameBDBM50040352
Synonyms:1,3-Bis-cyclopropylmethyl-8-[1-methyl-pyrrolidin-(2Z)-ylideneamino]-7-(3,4,5-trimethoxy-benzyl)-3,7-dihydro-purine-2,6-dione | CHEMBL359185
TypeSmall organic molecule
Emp. Form.C28H36N6O5
Mol. Mass.536.6226
SMILESCOc1cc(Cn2c(N=C3CCCN3C)nc3n(CC4CC4)c(=O)n(CC4CC4)c(=O)c23)cc(OC)c1OC