Reaction Details
TargetcGMP-specific 3',5'-cyclic phosphodiesterase
LigandBDBM50040370
Substrate/Competitorn/a
Meas. Tech.ChEMBL_155377 (CHEMBL760830)
IC50 56000±n/a nM
Citation Buckle, DRArch, JRConnolly, BJFenwick, AEFoster, KAMurray, KJReadshaw, SASmallridge, MSmith, DG Inhibition of cyclic nucleotide phosphodiesterase by derivatives of 1,3-bis(cyclopropylmethyl)xanthine. J Med Chem37:476-85 (1994) cGMP-specific 3',5'-cyclic phosphodiesterase
Name:cGMP-specific 3',5'-cyclic phosphodiesterase
Type:Protein
Mol. Mass.:99975.83
Organism:Homo sapiens (Human)
Description:O76074
Residue:875
BDBM50040370
NameBDBM50040370
Synonyms:CHEMBL145515 | N'-(1,3-Bis-cyclopropylmethyl-2,6-dioxo-2,3,6,7-tetrahydro-1H-purin-8-yl)-N,N-dimethyl-formamidine
TypeSmall organic molecule
Emp. Form.C16H22N6O2
Mol. Mass.330.3849
SMILESCN(C)C=Nc1nc2n(CC3CC3)c(=O)n(CC3CC3)c(=O)c2[nH]1