Reaction Details
TargetcGMP-specific 3',5'-cyclic phosphodiesterase
LigandBDBM50040375
Substrate/Competitorn/a
Meas. Tech.ChEMBL_155377 (CHEMBL760830)
IC50 34000±n/a nM
Citation Buckle, DRArch, JRConnolly, BJFenwick, AEFoster, KAMurray, KJReadshaw, SASmallridge, MSmith, DG Inhibition of cyclic nucleotide phosphodiesterase by derivatives of 1,3-bis(cyclopropylmethyl)xanthine. J Med Chem37:476-85 (1994) cGMP-specific 3',5'-cyclic phosphodiesterase
Name:cGMP-specific 3',5'-cyclic phosphodiesterase
Type:Protein
Mol. Mass.:99975.83
Organism:Homo sapiens (Human)
Description:O76074
Residue:875
BDBM50040375
NameBDBM50040375
Synonyms:1,3-Bis(cyclopropylmethyl)-8-bis[(4-nitrophenylsulfonyl)amino]7-methylxanthine | CHEMBL357428
TypeSmall organic molecule
Emp. Form.C26H25N7O10S2
Mol. Mass.659.648
SMILESCn1c(nc2n(CC3CC3)c(=O)n(CC3CC3)c(=O)c12)N(S(=O)(=O)c1ccc(cc1)[N+]([O-])=O)S(=O)(=O)c1ccc(cc1)[N+]([O-])=O