Reaction Details
TargetcGMP-specific 3',5'-cyclic phosphodiesterase
LigandBDBM50040357
Substrate/Competitorn/a
Meas. Tech.ChEMBL_155377 (CHEMBL760830)
IC50 22000±n/a nM
Citation Buckle, DRArch, JRConnolly, BJFenwick, AEFoster, KAMurray, KJReadshaw, SASmallridge, MSmith, DG Inhibition of cyclic nucleotide phosphodiesterase by derivatives of 1,3-bis(cyclopropylmethyl)xanthine. J Med Chem37:476-85 (1994) cGMP-specific 3',5'-cyclic phosphodiesterase
Name:cGMP-specific 3',5'-cyclic phosphodiesterase
Type:Protein
Mol. Mass.:99975.83
Organism:Homo sapiens (Human)
Description:O76074
Residue:875
BDBM50040357
NameBDBM50040357
Synonyms:CHEMBL358574 | N-(1,3-Bis-cyclopropylmethyl-2,6-dioxo-2,3,6,7-tetrahydro-1H-purin-8-yl)-N'-tert-butyl-formamidine
TypeSmall organic molecule
Emp. Form.C18H26N6O2
Mol. Mass.358.438
SMILESCC(C)(C)NC=Nc1nc2n(CC3CC3)c(=O)n(CC3CC3)c(=O)c2[nH]1