Reaction Details
TargetcGMP-specific 3',5'-cyclic phosphodiesterase
LigandBDBM50040376
Substrate/Competitorn/a
Meas. Tech.ChEMBL_155377 (CHEMBL760830)
IC50 6500±n/a nM
Citation Buckle, DRArch, JRConnolly, BJFenwick, AEFoster, KAMurray, KJReadshaw, SASmallridge, MSmith, DG Inhibition of cyclic nucleotide phosphodiesterase by derivatives of 1,3-bis(cyclopropylmethyl)xanthine. J Med Chem37:476-85 (1994) cGMP-specific 3',5'-cyclic phosphodiesterase
Name:cGMP-specific 3',5'-cyclic phosphodiesterase
Type:Protein
Mol. Mass.:99975.83
Organism:Homo sapiens (Human)
Description:O76074
Residue:875
BDBM50040376
NameBDBM50040376
Synonyms:1,3-Bis(cyclopropylmethyl)-8-bis[(phenylsulfonyl)amino]7-(4-methoxybenzyl)xanthine | CHEMBL356928
TypeSmall organic molecule
Emp. Form.C33H33N5O7S2
Mol. Mass.675.774
SMILESCOc1ccc(Cn2c(nc3n(CC4CC4)c(=O)n(CC4CC4)c(=O)c23)N(S(=O)(=O)c2ccccc2)S(=O)(=O)c2ccccc2)cc1