Reaction Details
TargetAdenosine receptor A1
LigandBDBM50040355
Substrate/Competitorn/a
Meas. Tech.ChEMBL_28668 (CHEMBL649066)
IC50 2400±n/a nM
Citation Buckle, DRArch, JRConnolly, BJFenwick, AEFoster, KAMurray, KJReadshaw, SASmallridge, MSmith, DG Inhibition of cyclic nucleotide phosphodiesterase by derivatives of 1,3-bis(cyclopropylmethyl)xanthine. J Med Chem37:476-85 (1994) Adenosine receptor A1
Name:Adenosine receptor A1
Type:Protein
Mol. Mass.:36704.13
Organism:Rattus norvegicus (rat)
Description:n/a
Residue:326
BDBM50040355
NameBDBM50040355
Synonyms:1,3-Bis(cyclopropylmethyl)-8-bis[(4-nitrophenylsulfonyl)amino]xanthine | CHEMBL144545
TypeSmall organic molecule
Emp. Form.C25H23N7O10S2
Mol. Mass.645.621
SMILES[O-][N+](=O)c1ccc(cc1)S(=O)(=O)N(c1nc2n(CC3CC3)c(=O)n(CC3CC3)c(=O)c2[nH]1)S(=O)(=O)c1ccc(cc1)[N+]([O-])=O