Reaction Details
TargetcGMP-dependent 3',5'-cyclic phosphodiesterase
LigandBDBM50040375
Substrate/Competitorn/a
Meas. Tech.ChEMBL_156303 (CHEMBL760824)
IC50 5400±n/a nM
Citation Buckle, DRArch, JRConnolly, BJFenwick, AEFoster, KAMurray, KJReadshaw, SASmallridge, MSmith, DG Inhibition of cyclic nucleotide phosphodiesterase by derivatives of 1,3-bis(cyclopropylmethyl)xanthine. J Med Chem37:476-85 (1994) cGMP-dependent 3',5'-cyclic phosphodiesterase
Name:cGMP-dependent 3',5'-cyclic phosphodiesterase
Type:PROTEIN
Mol. Mass.:103200.18
Organism:Bos taurus
Description:ChEMBL_154420
Residue:921
BDBM50040375
NameBDBM50040375
Synonyms:1,3-Bis(cyclopropylmethyl)-8-bis[(4-nitrophenylsulfonyl)amino]7-methylxanthine | CHEMBL357428
TypeSmall organic molecule
Emp. Form.C26H25N7O10S2
Mol. Mass.659.648
SMILESCn1c(nc2n(CC3CC3)c(=O)n(CC3CC3)c(=O)c12)N(S(=O)(=O)c1ccc(cc1)[N+]([O-])=O)S(=O)(=O)c1ccc(cc1)[N+]([O-])=O