Reaction Details
TargetAdenosine receptor A1
LigandBDBM50040359
Substrate/Competitorn/a
Meas. Tech.ChEMBL_28668 (CHEMBL649066)
IC50 1000±n/a nM
Citation Buckle, DRArch, JRConnolly, BJFenwick, AEFoster, KAMurray, KJReadshaw, SASmallridge, MSmith, DG Inhibition of cyclic nucleotide phosphodiesterase by derivatives of 1,3-bis(cyclopropylmethyl)xanthine. J Med Chem37:476-85 (1994) Adenosine receptor A1
Name:Adenosine receptor A1
Type:Protein
Mol. Mass.:36704.13
Organism:Rattus norvegicus (rat)
Description:n/a
Residue:326
BDBM50040359
NameBDBM50040359
Synonyms:CHEMBL145159 | N-[1,3-Bis-cyclopropylmethyl-7-(4-methoxy-benzyl)-2,6-dioxo-2,3,6,7-tetrahydro-1H-purin-8-yl]-4-methoxy-benzenesulfonamide
TypeSmall organic molecule
Emp. Form.C28H31N5O6S
Mol. Mass.565.641
SMILESCOc1ccc(Cn2c(NS(=O)(=O)c3ccc(OC)cc3)nc3n(CC4CC4)c(=O)n(CC4CC4)c(=O)c23)cc1