Reaction Details
TargetAdenosine receptor A1
LigandBDBM50040362
Substrate/Competitorn/a
Meas. Tech.ChEMBL_28668 (CHEMBL649066)
IC50 2800±n/a nM
Citation Buckle, DRArch, JRConnolly, BJFenwick, AEFoster, KAMurray, KJReadshaw, SASmallridge, MSmith, DG Inhibition of cyclic nucleotide phosphodiesterase by derivatives of 1,3-bis(cyclopropylmethyl)xanthine. J Med Chem37:476-85 (1994) Adenosine receptor A1
Name:Adenosine receptor A1
Type:Protein
Mol. Mass.:36704.13
Organism:Rattus norvegicus (rat)
Description:n/a
Residue:326
BDBM50040362
NameBDBM50040362
Synonyms:8-Amino-7-benzyl-1,3-bis-cyclopropylmethyl-3,7-dihydro-purine-2,6-dione | CHEMBL142782
TypeSmall organic molecule
Emp. Form.C20H23N5O2
Mol. Mass.365.4289
SMILESNc1nc2n(CC3CC3)c(=O)n(CC3CC3)c(=O)c2n1Cc1ccccc1