Reaction Details
TargetCannabinoid receptor 1
LigandBDBM50494088
Substrate/Competitorn/a
Meas. Tech.ChEMBL_990337 (CHEMBL2445750)
Ki 124±n/a nM
Citation Petrov, RRKnight, LChen, SRWager-Miller, JMcDaniel, SWDiaz, FBarth, FPan, HLMackie, KCavasotto, CNDiaz, P Mastering tricyclic ring systems for desirable functional cannabinoid activity. Eur J Med Chem69:881-907 (2013) 
 
Cannabinoid receptor 1
Name:Cannabinoid receptor 1
Type:G Protein-Coupled Receptor (GPCR)
Mol. Mass.:52856.55
Organism:Rattus norvegicus (rat)
Description:P20272
Residue:473
BDBM50494088
NameBDBM50494088
Synonyms:CHEMBL2441459
TypeSmall organic molecule
Emp. Form.C21H23ClN2O
Mol. Mass.354.873
SMILESClCCCn1c2ccccc2c2cc(ccc12)C(=O)N1CCCCC1