Reaction Details
TargetCannabinoid receptor 1
LigandBDBM50494106
Substrate/Competitorn/a
Meas. Tech.ChEMBL_990337 (CHEMBL2445750)
Ki 136±n/a nM
Citation Petrov, RRKnight, LChen, SRWager-Miller, JMcDaniel, SWDiaz, FBarth, FPan, HLMackie, KCavasotto, CNDiaz, P Mastering tricyclic ring systems for desirable functional cannabinoid activity. Eur J Med Chem69:881-907 (2013) 
 
Cannabinoid receptor 1
Name:Cannabinoid receptor 1
Type:G Protein-Coupled Receptor (GPCR)
Mol. Mass.:52856.55
Organism:Rattus norvegicus (rat)
Description:P20272
Residue:473
BDBM50494106
NameBDBM50494106
Synonyms:CHEMBL2441450
TypeSmall organic molecule
Emp. Form.C22H27N3O
Mol. Mass.349.4693
SMILESCCCCCn1c2ccccc2c2cc(ncc12)C(=O)N1CCCCC1