Reaction Details
TargetCannabinoid receptor 2
LigandBDBM50494118
Substrate/Competitorn/a
Meas. Tech.ChEMBL_990336 (CHEMBL2445749)
Ki 85±n/a nM
Citation Petrov, RRKnight, LChen, SRWager-Miller, JMcDaniel, SWDiaz, FBarth, FPan, HLMackie, KCavasotto, CNDiaz, P Mastering tricyclic ring systems for desirable functional cannabinoid activity. Eur J Med Chem69:881-907 (2013) 
 
Cannabinoid receptor 2
Name:Cannabinoid receptor 2
Type:G Protein-Coupled Receptor (GPCR)
Mol. Mass.:39690.94
Organism:Homo sapiens (Human)
Description:P34972
Residue:360
BDBM50494118
NameBDBM50494118
Synonyms:CHEMBL2441255
TypeSmall organic molecule
Emp. Form.C22H26N2O2
Mol. Mass.350.454
SMILESCCCCCn1c2ccccc2c2cc(ccc12)C(=O)N1CCOCC1