Reaction Details
TargetCannabinoid receptor 1
LigandBDBM50494098
Substrate/Competitorn/a
Meas. Tech.ChEMBL_990337 (CHEMBL2445750)
Ki 123±n/a nM
Citation Petrov, RRKnight, LChen, SRWager-Miller, JMcDaniel, SWDiaz, FBarth, FPan, HLMackie, KCavasotto, CNDiaz, P Mastering tricyclic ring systems for desirable functional cannabinoid activity. Eur J Med Chem69:881-907 (2013) 
 
Cannabinoid receptor 1
Name:Cannabinoid receptor 1
Type:G Protein-Coupled Receptor (GPCR)
Mol. Mass.:52856.55
Organism:Rattus norvegicus (rat)
Description:P20272
Residue:473
BDBM50494098
NameBDBM50494098
Synonyms:CHEMBL2441256
TypeSmall organic molecule
Emp. Form.C23H29N3O
Mol. Mass.363.4959
SMILESCCCCCn1c2ccccc2c2cc(ccc12)C(=O)N1CCN(C)CC1