Reaction Details
TargetCannabinoid receptor 1
LigandBDBM50494092
Substrate/Competitorn/a
Meas. Tech.ChEMBL_990337 (CHEMBL2445750)
Ki 44±n/a nM
Citation Petrov, RRKnight, LChen, SRWager-Miller, JMcDaniel, SWDiaz, FBarth, FPan, HLMackie, KCavasotto, CNDiaz, P Mastering tricyclic ring systems for desirable functional cannabinoid activity. Eur J Med Chem69:881-907 (2013) 
 
Cannabinoid receptor 1
Name:Cannabinoid receptor 1
Type:G Protein-Coupled Receptor (GPCR)
Mol. Mass.:52856.55
Organism:Rattus norvegicus (rat)
Description:P20272
Residue:473
BDBM50494092
NameBDBM50494092
Synonyms:CHEMBL2441452
TypeSmall organic molecule
Emp. Form.C22H29N3O
Mol. Mass.351.4852
SMILESCCCCCn1c2ccccc2c2cc(ncc12)C(=O)NCC(C)(C)C