Reaction Details
TargetCholecystokinin receptor type A
LigandBDBM50040680
Substrate/Competitorn/a
Meas. Tech.ChEMBL_50198 (CHEMBL663491)
IC50 6.16±n/a nM
Citation Bock, MGDiPardo, RMMellin, ECNewton, RCVeber, DFFreedman, SBSmith, AJPatel, SKemp, JAMarshall, GR Second-generation benzodiazepine CCK-B antagonists. Development of subnanomolar analogs with selectivity and water solubility. J Med Chem37:722-4 (1994) Cholecystokinin receptor type A
Name:Cholecystokinin receptor type A
Type:Enzyme Catalytic Domain
Mol. Mass.:49676.37
Organism:RAT
Description:Cholecystokinin central 0 RAT::P30551
Residue:444
BDBM50040680
NameBDBM50040680
Synonyms:1-((R)-1-Methyl-2-oxo-5-phenyl-2,3-dihydro-1H-benzo[e][1,4]diazepin-3-yl)-3-[4-(1H-tetrazol-5-yl)-phenyl]-urea | CHEMBL423472
TypeSmall organic molecule
Emp. Form.C24H20N8O2
Mol. Mass.452.468
SMILESCN1c2ccccc2C(=N[C@@H](NC(=O)Nc2ccc(cc2)-c2nnn[nH]2)C1=O)c1ccccc1