Reaction Details
TargetGag-Pol polyprotein [489-587]
LigandBDBM906
Substrate/Competitorn/a
Meas. Tech.ChEMBL_159974 (CHEMBL768121)
Ki 5370±n/a nM
Citation Reddy, MRVarney, MDKalish, VViswanadhan, VNAppelt, K Calculation of relative differences in the binding free energies of HIV1 protease inhibitors: a thermodynamic cycle perturbation approach. J Med Chem37:1145-52 (1994) Gag-Pol polyprotein [489-587]
Name:Gag-Pol polyprotein [489-587]
Type:Enzyme Subunit
Mol. Mass.:10781.16
Organism:Human immunodeficiency virus type 1
Description:P04585[489-587]
Residue:99
BDBM906
NameBDBM906
Synonyms:(4S,5S)-5-[(2S)-2-[(2S)-2-aminopropanamido]propanamido]-N-[1H-1,3-benzodiazol-2-yl(phenyl)methyl]-4-hydroxy-6-phenylhexanamide C-terminal inhibitor 4 | CHEMBL15049
TypeSmall organic molecule
Emp. Form.C32H38N6O4
Mol. Mass.570.6819
SMILESC[C@H](N)C(=O)N[C@@H](C)C(=O)N[C@@H](Cc1ccccc1)[C@@H](O)CCC(=O)NC(c1nc2ccccc2[nH]1)c1ccccc1