Reaction Details
TargetGag-Pol polyprotein [489-587]
LigandBDBM50041152
Substrate/Competitorn/a
Meas. Tech.ChEMBL_159974 (CHEMBL768121)
Ki 200±n/a nM
Citation Reddy, MRVarney, MDKalish, VViswanadhan, VNAppelt, K Calculation of relative differences in the binding free energies of HIV1 protease inhibitors: a thermodynamic cycle perturbation approach. J Med Chem37:1145-52 (1994) Gag-Pol polyprotein [489-587]
Name:Gag-Pol polyprotein [489-587]
Type:Enzyme Subunit
Mol. Mass.:10781.16
Organism:Human immunodeficiency virus type 1
Description:P04585[489-587]
Residue:99
BDBM50041152
NameBDBM50041152
Synonyms:CHEMBL278745 | N-((1S,2S)-1-Benzyl-2-hydroxy-4-{[(1H-indol-2-yl)-phenyl-methyl]-carbamoyl}-butyl)-2-[(quinoline-2-carbonyl)-amino]-succinamic acid
TypeSmall organic molecule
Emp. Form.C41H39N5O6
Mol. Mass.697.7783
SMILESO[C@@H](CCC(=O)NC(c1cc2ccccc2[nH]1)c1ccccc1)[C@H](Cc1ccccc1)NC(=O)CC(NC(=O)c1ccc2ccccc2n1)C(O)=O