Reaction Details
TargetSigma non-opioid intracellular receptor 1
LigandBDBM50000069
Substrate/Competitorn/a
Meas. Tech.ChEMBL_201740 (CHEMBL809875)
Ki 0.34±n/a nM
Citation Glennon, RAAblordeppey, SYIsmaiel, AMel-Ashmawy, MBFischer, JBHowie, KB Structural features important for sigma 1 receptor binding. J Med Chem37:1214-9 (1994) Sigma non-opioid intracellular receptor 1
Name:Sigma non-opioid intracellular receptor 1
Type:Enzyme Catalytic Domain
Mol. Mass.:25124.85
Organism:Homo sapiens (Human)
Description:Q99720
Residue:223
BDBM50000069
NameBDBM50000069
Synonyms:CHEMBL20377 | [2-(3,4-Dichloro-phenyl)-ethyl]-methyl-(2-pyrrolidin-1-yl-ethyl)-amine
TypeSmall organic molecule
Emp. Form.C15H22Cl2N2
Mol. Mass.301.255
SMILESCN(CCN1CCCC1)CCc1ccc(Cl)c(Cl)c1