Reaction Details
TargetCannabinoid receptor 2
LigandBDBM50494951
Substrate/Competitorn/a
Meas. Tech.ChEMBL_1281947 (CHEMBL3101345)
IC50 1.4±n/a nM
Citation Hortala, LArnaud, JRoux, POustric, DBoulu, LOury-Donat, FAvenet, PRooney, TAlagille, DBarret, OTamagnan, GBarth, F Synthesis and preliminary evaluation of a new fluorine-18 labelled triazine derivative for PET imaging of cannabinoid CB2 receptor. Bioorg Med Chem Lett24:283-7 (2014) 
 
Cannabinoid receptor 2
Name:Cannabinoid receptor 2
Type:G Protein-Coupled Receptor (GPCR)
Mol. Mass.:39690.94
Organism:Homo sapiens (Human)
Description:P34972
Residue:360
BDBM50494951
NameBDBM50494951
Synonyms:CHEMBL3099054
TypeSmall organic molecule
Emp. Form.C21H21ClF2N4O2
Mol. Mass.434.867
SMILESCC(C)(O)c1cc(ccc1Cl)-c1nc(NCCc2ccc(F)cc2)nc(OCF)n1