Reaction Details
TargetCannabinoid receptor 2
LigandBDBM176622
Substrate/Competitorn/a
Meas. Tech.ChEMBL_1281948 (CHEMBL3101346)
IC50 0.580000±n/a nM
Citation Hortala, LArnaud, JRoux, POustric, DBoulu, LOury-Donat, FAvenet, PRooney, TAlagille, DBarret, OTamagnan, GBarth, F Synthesis and preliminary evaluation of a new fluorine-18 labelled triazine derivative for PET imaging of cannabinoid CB2 receptor. Bioorg Med Chem Lett24:283-7 (2014) 
 
Cannabinoid receptor 2
Name:Cannabinoid receptor 2
Type:G Protein-Coupled Receptor (GPCR)
Mol. Mass.:39690.94
Organism:Homo sapiens (Human)
Description:P34972
Residue:360
BDBM176622
NameBDBM176622
Synonyms:US9115121, 13
TypeSmall organic molecule
Emp. Form.C21H22ClFN4O2
Mol. Mass.416.876
SMILESCOc1nc(NCCc2ccc(F)cc2)nc(n1)-c1ccc(Cl)c(c1)C(C)(C)O