Reaction Details
TargetBeta-2 adrenergic receptor
LigandBDBM25392
Substrate/Competitorn/a
Meas. Tech.ChEMBL_1283080 (CHEMBL3100636)
EC50 0.200000±n/a nM
Citation Plazinska, APajak, KRutkowska, EJimenez, LKozocas, JKoolpe, GTanga, MToll, LWainer, IWJozwiak, K Comparative molecular field analysis of fenoterol derivatives interacting with an agonist-stabilized form of the ??-adrenergic receptor. Bioorg Med Chem22:234-46 (2014) 
 
Beta-2 adrenergic receptor
Name:Beta-2 adrenergic receptor
Type:n/a
Mol. Mass.:46461.69
Organism:Homo sapiens (Human)
Description:P07550
Residue:413
BDBM25392
NameBDBM25392
Synonyms:4-[1-hydroxy-2-(isopropylamino)ethyl]pyrocatechol;hydrochloride 4-{1-hydroxy-2-[(propan-2-yl)amino]ethyl}benzene-1,2-diol, 2 ISOPROTERONOL Isoproterenol Isoproterenol,(+) Norisodrine | Novodrin
TypeSmall organic molecule
Emp. Form.C11H17NO3
Mol. Mass.211.2576
SMILESCC(C)NCC(O)c1ccc(O)c(O)c1