Reaction Details
TargetBeta-2 adrenergic receptor
LigandBDBM50348427
Substrate/Competitorn/a
Meas. Tech.ChEMBL_1283081 (CHEMBL3100637)
Ki 294±n/a nM
Citation Plazinska, APajak, KRutkowska, EJimenez, LKozocas, JKoolpe, GTanga, MToll, LWainer, IWJozwiak, K Comparative molecular field analysis of fenoterol derivatives interacting with an agonist-stabilized form of the ??-adrenergic receptor. Bioorg Med Chem22:234-46 (2014) 
 
Beta-2 adrenergic receptor
Name:Beta-2 adrenergic receptor
Type:n/a
Mol. Mass.:46461.69
Organism:Homo sapiens (Human)
Description:P07550
Residue:413
BDBM50348427
NameBDBM50348427
Synonyms:CHEMBL1800960 | US9492405, 49
TypeSmall organic molecule
Emp. Form.C18H23NO4
Mol. Mass.317.3795
SMILESCC[C@@H](Cc1ccc(O)cc1)NC[C@H](O)c1cc(O)cc(O)c1