Reaction Details
TargetCannabinoid receptor 1
LigandBDBM50233605
Substrate/Competitorn/a
Meas. Tech.ChEMBL_1285973 (CHEMBL3106280)
EC50 0.400000±n/a nM
Citation Sharma, RNikas, SPParonis, CAWood, JTHalikhedkar, AGuo, JJThakur, GAKulkarni, SBenchama, ORaghav, JGGifford, RSJärbe, TUBergman, JMakriyannis, A Controlled-deactivation cannabinergic ligands. J Med Chem56:10142-57 (2013) 
 
Cannabinoid receptor 1
Name:Cannabinoid receptor 1
Type:G Protein-Coupled Receptor (GPCR)
Mol. Mass.:52856.55
Organism:Rattus norvegicus (rat)
Description:P20272
Residue:473
BDBM50233605
NameBDBM50233605
Synonyms:CHEMBL3104362 | US10882838, Example 1.20
TypeSmall organic molecule
Emp. Form.C25H34O4
Mol. Mass.398.5351
SMILES[H][C@@]12CC(C)=CC[C@@]1([H])C(C)(C)Oc1cc(cc(O)c21)C1(CCC1)C(=O)OCCCC