Reaction Details
TargetSigma non-opioid intracellular receptor 1
LigandBDBM81924
Substrate/Competitorn/a
Meas. Tech.ChEMBL_201887 (CHEMBL809042)
IC50 430±n/a nM
Citation Sonesson, CWaters, NSvensson, KCarlsson, ASmith, MWPiercey, MFMeier, EWikström, H Substituted 3-phenylpiperidines: new centrally acting dopamine autoreceptor antagonists. J Med Chem36:3188-96 (1993) Sigma non-opioid intracellular receptor 1
Name:Sigma non-opioid intracellular receptor 1
Type:Enzyme Catalytic Domain
Mol. Mass.:25266.54
Organism:RAT
Description:Q9R0C9
Residue:223
BDBM81924
NameBDBM81924
Synonyms:(R)-3-(1-Propyl-piperidin-3-yl)-phenol CAS_85976-54-1 NSC_202477 PPP, S(-)-3
TypeSmall organic molecule
Emp. Form.C14H21NO
Mol. Mass.219.3226
SMILESCCCN1CCCC(C1)c1cccc(O)c1