Reaction Details
TargetD(2) dopamine receptor
LigandBDBM50041959
Substrate/Competitorn/a
Meas. Tech.ChEMBL_59485 (CHEMBL670137)
Ki 158±n/a nM
Citation Sonesson, CWaters, NSvensson, KCarlsson, ASmith, MWPiercey, MFMeier, EWikström, H Substituted 3-phenylpiperidines: new centrally acting dopamine autoreceptor antagonists. J Med Chem36:3188-96 (1993) D(2) dopamine receptor
Name:D(2) dopamine receptor
Type:Enzyme Catalytic Domain
Mol. Mass.:50698.79
Organism:BOVINE
Description:P20288
Residue:444
BDBM50041959
NameBDBM50041959
Synonyms:((1S,2R)-5-Methoxy-1-methyl-1,2,3,4-tetrahydro-naphthalen-2-yl)-propyl-amine (1S,2R)-(5-Methoxy-1-methyl-1,2,3,4-tetrahydro-naphthalen-2-yl)-propyl-amine AJ76(+) | CHEMBL27441
TypeSmall organic molecule
Emp. Form.C15H23NO
Mol. Mass.233.3492
SMILESCCCN[C@@H]1CCc2c(OC)cccc2[C@@H]1C