Reaction Details
TargetCalpain-2 catalytic subunit
LigandBDBM50042398
Substrate/Competitorn/a
Meas. Tech.ChEBML_43855
pH8±n/a
Ki 78±n/a nM
Commentsextracted
Citation Li, ZPatil, GSGolubski, ZEHori, HTehrani, KForeman, JEEveleth, DDBartus, RTPowers, JC Peptide alpha-keto ester, alpha-keto amide, and alpha-keto acid inhibitors of calpains and other cysteine proteases. J Med Chem36:3472-80 (1993) Calpain-2 catalytic subunit
Name:Calpain-2 catalytic subunit
Type:Protein
Mol. Mass.:79965.18
Organism:Homo sapiens (Human)
Description:n/a
Residue:700
BDBM50042398
NameBDBM50042398
Synonyms:CHEMBL117840 | [1-(1-Aminooxalyl-butylcarbamoyl)-3-methyl-butyl]-carbamic acid benzyl ester
TypeSmall organic molecule
Emp. Form.C20H29N3O5
Mol. Mass.391.4614
SMILESCCCC(NC(=O)C(CC(C)C)NC(=O)OCc1ccccc1)C(=O)C(N)=O