Reaction Details
TargetCalpain-2 catalytic subunit
LigandBDBM50042424
Substrate/Competitorn/a
Meas. Tech.ChEBML_43855
pH8±n/a
Ki 180±n/a nM
Commentsextracted
Citation Li, ZPatil, GSGolubski, ZEHori, HTehrani, KForeman, JEEveleth, DDBartus, RTPowers, JC Peptide alpha-keto ester, alpha-keto amide, and alpha-keto acid inhibitors of calpains and other cysteine proteases. J Med Chem36:3472-80 (1993) Calpain-2 catalytic subunit
Name:Calpain-2 catalytic subunit
Type:Protein
Mol. Mass.:79965.18
Organism:Homo sapiens (Human)
Description:n/a
Residue:700
BDBM50042424
NameBDBM50042424
Synonyms:3-(2-Benzyloxycarbonylamino-4-methyl-pentanoylamino)-2-oxo-heptanoic acid ethyl ester | CHEMBL116358
TypeSmall organic molecule
Emp. Form.C23H34N2O6
Mol. Mass.434.5259
SMILESCCCCC(NC(=O)C(CC(C)C)NC(=O)OCc1ccccc1)C(=O)C(=O)OCC