Reaction Details
TargetCalpain-2 catalytic subunit
LigandBDBM50042403
Substrate/Competitorn/a
Meas. Tech.ChEBML_43855
pH8±n/a
Ki 19±n/a nM
Commentsextracted
Citation Li, ZPatil, GSGolubski, ZEHori, HTehrani, KForeman, JEEveleth, DDBartus, RTPowers, JC Peptide alpha-keto ester, alpha-keto amide, and alpha-keto acid inhibitors of calpains and other cysteine proteases. J Med Chem36:3472-80 (1993) Calpain-2 catalytic subunit
Name:Calpain-2 catalytic subunit
Type:Protein
Mol. Mass.:79965.18
Organism:Homo sapiens (Human)
Description:n/a
Residue:700
BDBM50042403
NameBDBM50042403
Synonyms:CHEMBL325223 | [3-Methyl-1-(1-octylaminooxalyl-propylcarbamoyl)-butyl]-carbamic acid benzyl ester
TypeSmall organic molecule
Emp. Form.C27H43N3O5
Mol. Mass.489.6474
SMILESCCCCCCCCNC(=O)C(=O)C(CC)NC(=O)C(CC(C)C)NC(=O)OCc1ccccc1