Reaction Details
TargetPapain
LigandBDBM50042395
Substrate/Competitorn/a
Meas. Tech.ChEBML_152654
pH6±n/a
Ki 38000±n/a nM
Commentsextracted
Citation Li, ZPatil, GSGolubski, ZEHori, HTehrani, KForeman, JEEveleth, DDBartus, RTPowers, JC Peptide alpha-keto ester, alpha-keto amide, and alpha-keto acid inhibitors of calpains and other cysteine proteases. J Med Chem36:3472-80 (1993) Papain
Name:Papain
Type:Enzyme
Mol. Mass.:38923.01
Organism:Carica papaya
Description:Papain was purchased from Sigma, Germany.
Residue:345
BDBM50042395
NameBDBM50042395
Synonyms:CHEMBL117336 | [3-Methyl-1-(1-phenethylaminooxalyl-propylcarbamoyl)-butyl]-carbamic acid benzyl ester
TypeSmall organic molecule
Emp. Form.C27H35N3O5
Mol. Mass.481.5839
SMILESCCC(NC(=O)C(CC(C)C)NC(=O)OCc1ccccc1)C(=O)C(=O)NCCc1ccccc1