Reaction Details
TargetCalpain small subunit 1/1 catalytic subunit
LigandBDBM50042433
Substrate/Competitorn/a
Meas. Tech.ChEMBL_43671 (CHEMBL656204)
Ki 3400±n/a nM
Citation Li, ZPatil, GSGolubski, ZEHori, HTehrani, KForeman, JEEveleth, DDBartus, RTPowers, JC Peptide alpha-keto ester, alpha-keto amide, and alpha-keto acid inhibitors of calpains and other cysteine proteases. J Med Chem36:3472-80 (1993) Calpain small subunit 1/1 catalytic subunit
Name:Calpain small subunit 1/1 catalytic subunit
Type:n/a
Mol. Mass.:n/a
Description:ASSAY_ID of EBI is 43671
Components:This complex has 2 components.
Component 1
Name:Calpain small subunit 1
Synonyms:CAPN4 CAPNS1 Calpain 1
Type:PROTEIN
Mol. Mass.:28309.36
Organism:Homo sapiens (Human)
Description:EBI_12682
Residue:268
Component 2
Name:Calpain-1 catalytic subunit
Synonyms:CAN1_HUMAN CAPN1 Calpain-1 (u-Calpain) Calpain1
Type:Protein
Mol. Mass.:81880.51
Organism:Homo sapiens (Human)
Description:n/a
Residue:714
BDBM50042433
NameBDBM50042433
Synonyms:3-(2-Benzyloxycarbonylamino-4-methyl-pentanoylamino)-2-oxo-4-phenyl-butyric acid benzyl ester | CHEMBL324834
TypeSmall organic molecule
Emp. Form.C31H34N2O6
Mol. Mass.530.6115
SMILESCC(C)CC(NC(=O)OCc1ccccc1)C(=O)NC(Cc1ccccc1)C(=O)C(=O)OCc1ccccc1