Reaction Details
TargetHistone deacetylase 6
LigandBDBM41564
Substrate/Competitorn/a
Meas. Tech.ChEMBL_1286783 (CHEMBL3111888)
IC50 1006±n/a nM
Citation Sodji, QHPatil, VKornacki, JRMrksich, MOyelere, AK Synthesis and structure-activity relationship of 3-hydroxypyridine-2-thione-based histone deacetylase inhibitors. J Med Chem56:9969-81 (2013) 
 
Histone deacetylase 6
Name:Histone deacetylase 6
Type:Chromatin regulator; hydrolase; repressor
Mol. Mass.:131381.51
Organism:Homo sapiens (Human)
Description:Q9UBN7
Residue:1215
BDBM41564
NameBDBM41564
Synonyms:US8871728, 167f
Typen/a
Emp. Form.C20H25N5OS
Mol. Mass.383.51
SMILESCN(C)c1ccc(cc1)-c1cn(CCCCCn2cccc(O)c2=S)nn1