Reaction Details
TargetHistone deacetylase 6
LigandBDBM41547
Substrate/Competitorn/a
Meas. Tech.ChEMBL_1286783 (CHEMBL3111888)
IC50 911±n/a nM
Citation Sodji, QHPatil, VKornacki, JRMrksich, MOyelere, AK Synthesis and structure-activity relationship of 3-hydroxypyridine-2-thione-based histone deacetylase inhibitors. J Med Chem56:9969-81 (2013) 
 
Histone deacetylase 6
Name:Histone deacetylase 6
Type:Chromatin regulator; hydrolase; repressor
Mol. Mass.:131381.51
Organism:Homo sapiens (Human)
Description:Q9UBN7
Residue:1215
BDBM41547
NameBDBM41547
Synonyms:US8871728, 162d
Typen/a
Emp. Form.C18H20N4OS
Mol. Mass.340.443
SMILESOc1cccn(CCCCCn2cc(nn2)-c2ccccc2)c1=S