Reaction Details
TargetHistone deacetylase 6
LigandBDBM41558
Substrate/Competitorn/a
Meas. Tech.ChEMBL_1286783 (CHEMBL3111888)
IC50 955±n/a nM
Citation Sodji, QHPatil, VKornacki, JRMrksich, MOyelere, AK Synthesis and structure-activity relationship of 3-hydroxypyridine-2-thione-based histone deacetylase inhibitors. J Med Chem56:9969-81 (2013) 
 
Histone deacetylase 6
Name:Histone deacetylase 6
Type:Chromatin regulator; hydrolase; repressor
Mol. Mass.:131381.51
Organism:Homo sapiens (Human)
Description:Q9UBN7
Residue:1215
BDBM41558
NameBDBM41558
Synonyms:US8871728, 162f
Typen/a
Emp. Form.C20H24N4OS
Mol. Mass.368.496
SMILESOc1cccn(CCCCCCCn2cc(nn2)-c2ccccc2)c1=S