Reaction Details
TargetHistone deacetylase 6
LigandBDBM41563
Substrate/Competitorn/a
Meas. Tech.ChEMBL_1286783 (CHEMBL3111888)
IC50 356±n/a nM
Citation Sodji, QHPatil, VKornacki, JRMrksich, MOyelere, AK Synthesis and structure-activity relationship of 3-hydroxypyridine-2-thione-based histone deacetylase inhibitors. J Med Chem56:9969-81 (2013) 
 
Histone deacetylase 6
Name:Histone deacetylase 6
Type:Chromatin regulator; hydrolase; repressor
Mol. Mass.:131381.51
Organism:Homo sapiens (Human)
Description:Q9UBN7
Residue:1215
BDBM41563
NameBDBM41563
Synonyms:US8871728, 167e
Typen/a
Emp. Form.C19H19N5OS
Mol. Mass.365.452
SMILESOc1cccn(CCCCCn2cc(nn2)-c2cccc(c2)C#N)c1=S