Reaction Details
TargetHistone deacetylase 6
LigandBDBM41559
Substrate/Competitorn/a
Meas. Tech.ChEMBL_1286783 (CHEMBL3111888)
IC50 807±n/a nM
Citation Sodji, QHPatil, VKornacki, JRMrksich, MOyelere, AK Synthesis and structure-activity relationship of 3-hydroxypyridine-2-thione-based histone deacetylase inhibitors. J Med Chem56:9969-81 (2013) 
 
Histone deacetylase 6
Name:Histone deacetylase 6
Type:Chromatin regulator; hydrolase; repressor
Mol. Mass.:131381.51
Organism:Homo sapiens (Human)
Description:Q9UBN7
Residue:1215
BDBM41559
NameBDBM41559
Synonyms:US8871728, 167a
Typen/a
Emp. Form.C19H22N4OS
Mol. Mass.354.469
SMILESCc1ccc(cc1)-c1cn(CCCCCn2cccc(O)c2=S)nn1