Reaction Details
TargetHistone deacetylase 8
LigandBDBM41547
Substrate/Competitorn/a
Meas. Tech.ChEMBL_1286782 (CHEMBL3111887)
IC50 917±n/a nM
Citation Sodji, QHPatil, VKornacki, JRMrksich, MOyelere, AK Synthesis and structure-activity relationship of 3-hydroxypyridine-2-thione-based histone deacetylase inhibitors. J Med Chem56:9969-81 (2013) 
 
Histone deacetylase 8
Name:Histone deacetylase 8
Type:Enzyme
Mol. Mass.:41749.60
Organism:Homo sapiens (Human)
Description:Q9BY41
Residue:377
BDBM41547
NameBDBM41547
Synonyms:US8871728, 162d
Typen/a
Emp. Form.C18H20N4OS
Mol. Mass.340.443
SMILESOc1cccn(CCCCCn2cc(nn2)-c2ccccc2)c1=S