Reaction Details
Target3-hydroxy-3-methylglutaryl-coenzyme A reductase
LigandBDBM50042607
Substrate/Competitorn/a
Meas. Tech.ChEBML_78176
IC50 1±n/a nM
Citation Chan, CBailey, EJHartley, CDHayman, DFHutson, JLInglis, GGJones, PSKeeling, SEKirk, BELamont, RB Inhibitors of cholesterol biosynthesis. 1. 3,5-Dihydroxy-7-(N-imidazolyl)-6-heptenoates and -heptanoates, a novel series of HMG-CoA reductase inhibitors. J Med Chem36:3646-57 (1994) 3-hydroxy-3-methylglutaryl-coenzyme A reductase
Name:3-hydroxy-3-methylglutaryl-coenzyme A reductase
Type:Enzyme
Mol. Mass.:96689.85
Organism:Rattus norvegicus (rat)
Description:Isolated rat liver microsomes were used as enzyme source.
Residue:887
BDBM50042607
NameBDBM50042607
Synonyms:(E)-(3R,5S)-7-[4,5-Bis-(4-fluoro-phenyl)-2-isopropyl-imidazol-1-yl]-3,5-dihydroxy-hept-6-enoic acid anion CHEMBL333760
TypeSmall organic molecule
Emp. Form.C25H26F2N2O4
Mol. Mass.456.4817
SMILESCC(C)c1nc(c(-c2ccc(F)cc2)n1\C=C\[C@@H](O)C[C@@H](O)CC(O)=O)-c1ccc(F)cc1